Jump to content
OpenSplice DDS Forum
Sign in to follow this  
ABCD

Getting error while installing SIMD in RHEL

Recommended Posts

ABCD   

I am getting error while installing SIMD on my machine(RHEL 64bit) .

Following is the output of "make install" command:

 

 

Scanning dependencies of target libSimD
[  6%] Building CXX object src/dds/CMakeFiles/libSimD.dir/domain.cpp.o
/root/Downloads/simd-cxx/src/dds/domain.cpp: In constructor ‘dds::DomainParticipant::DomainParticipant(const std::string&)’:
/root/Downloads/simd-cxx/src/dds/domain.cpp:44: error: invalid conversion from ‘const char*’ to ‘DDS::DomainId_t’
/root/Downloads/simd-cxx/src/dds/domain.cpp:44: error:   initializing argument 1 of ‘virtual DDS::DomainParticipant* DDS::DomainParticipantFactoryInterface::create_participant(DDS::DomainId_t, const DDS::DomainParticipantQos&, DDS::DomainParticipantListener*, DDS::StatusMask)’
make[2]: *** [src/dds/CMakeFiles/libSimD.dir/domain.cpp.o] Error 1
make[1]: *** [src/dds/CMakeFiles/libSimD.dir/all] Error 2
make: *** [all] Error 2

 

 

What shall I do?
 

Share this post


Link to post
Share on other sites

Create an account or sign in to comment

You need to be a member in order to leave a comment

Create an account

Sign up for a new account in our community. It's easy!

Register a new account

Sign in

Already have an account? Sign in here.

Sign In Now
Sign in to follow this  

×