Jump to content
OpenSplice DDS Forum
getviswa

CamelOS with OpenSpliceDDS

Recommended Posts

getviswa   

Hi All,

 

While i am trying to implement CamelOs with OpenSpliceDDS Evaluation 6.1 version i am facing following error (with OpenSplice version 5.3 working fine) .

 

Please explain me what may be the issue ?? how to resolve it ??

 

-------------------------------------------------------

T E S T S

-------------------------------------------------------

Running org.opensplice.dds.idlcompiler.IDLMojoTest

[iNFO] Executing idl command[C:\Program Files (x86)\PrismTech\OpenSpliceDDS\V6.1.1p1\HDE\x86_64.win64\bin\idlpp, -d, E:\camel-windows\camelopensp

lice\maven-dds\plugins\opensplice-idl-plugin arget est-classes, -S, -l, java, -c, E:\camel-windows\camelopensplice\maven-dds\plugins\opensplice

-idl-plugin\pre, -D, Hello, -D, World, -I, E:\camel-windows\camelopensplice\maven-dds\plugins\opensplice-idl-plugin\myDir1, -I, E:\camel-windows\

camelopensplice\maven-dds\plugins\opensplice-idl-plugin\myDir2, E:\camel-windows\camelopensplice\maven-dds\plugins\opensplice-idl-plugin\src est

\java\projects\project1\resources\durable.idl]

[iNFO] C:\Program Files (x86)\PrismTech\OpenSpliceDDS\V6.1.1p1\HDE\x86_64.win64\bin\idlpp EVALUATION VERSION

Tests run: 2, Failures: 0, Errors: 1, Skipped: 0, Time elapsed: 0.663 sec <<< FAILURE!

 

Results :

 

Tests in error:

testIDLCompilation(org.opensplice.dds.idlcompiler.IDLMojoTest)

 

Tests run: 2, Failures: 0, Errors: 1, Skipped: 0

 

[iNFO] ------------------------------------------------------------------------

[iNFO] BUILD FAILURE

[iNFO] ------------------------------------------------------------------------

[iNFO] Total time: 2:54.281s

[iNFO] Finished at: Mon Jul 23 22:36:18 IST 2012

[iNFO] Final Memory: 7M/85M

[iNFO] ------------------------------------------------------------------------

[ERROR] Failed to execute goal org.apache.maven.plugins:maven-surefire-plugin:2.10:test (default-test) on project opensplice-idl-plugin: There ar

e test failures.

[ERROR]

[ERROR] Please refer to E:\camel-windows\camelopensplice\maven-dds\plugins\opensplice-idl-plugin arget\surefire-reports for the individual test

results.

[ERROR] -> [Help 1]

[ERROR]

[ERROR] To see the full stack trace of the errors, re-run Maven with the -e switch.

[ERROR] Re-run Maven using the -X switch to enable full debug logging.

[ERROR]

[ERROR] For more information about the errors and possible solutions, please read the following articles:

[ERROR] [Help 1] http://cwiki.apache....ailureException

 

 

Thanks

-Viswa

Share this post


Link to post
Share on other sites
getviswa   

Hello All,

 

I found where the issue caused, in the evaluation version while compiling IDL it is displaying "EVALUATION VERSION" as result, So it takes as failure.

 

I have used Community Edition 5.5.1 and it is compiled successfully.

 

Thanks

-Viswa

Share this post


Link to post
Share on other sites

Create an account or sign in to comment

You need to be a member in order to leave a comment

Create an account

Sign up for a new account in our community. It's easy!

Register a new account

Sign in

Already have an account? Sign in here.

Sign In Now

×