Jump to content
OpenSplice DDS Forum

Search the Community

Showing results for tags 'SIMD'.



More search options

  • Search By Tags

    Type tags separated by commas.
  • Search By Author

Content Type


Forums

  • About OpenSplice DDS
    • News and Events
    • Site Feedback
  • Using OpenSplice DDS
    • General
    • Troubleshooting
  • Understanding OpenSplice DDS
    • OpenSplice DDS Slideshows
    • OpenSplice DDS Movies
  • Community
    • Project: SIMD
    • Project: CamelOS
    • Project: DDS Touchstone
    • Project: RESTful DDS
    • Mac OS X

Find results in...

Find results that contain...


Date Created

  • Start

    End


Last Updated

  • Start

    End


Filter by number of...

Joined

  • Start

    End


Group


AIM


MSN


Website URL


ICQ


Yahoo


Jabber


Skype


Location


Interests


Company

Found 1 result

  1. I am getting error while installing SIMD on my machine(RHEL 64bit) . Following is the output of "make install" command: Scanning dependencies of target libSimD [ 6%] Building CXX object src/dds/CMakeFiles/libSimD.dir/domain.cpp.o /root/Downloads/simd-cxx/src/dds/domain.cpp: In constructor ‘dds::DomainParticipant::DomainParticipant(const std::string&)’: /root/Downloads/simd-cxx/src/dds/domain.cpp:44: error: invalid conversion from ‘const char*’ to ‘DDS::DomainId_t’ /root/Downloads/simd-cxx/src/dds/domain.cpp:44: error: initializing argument 1 of ‘virtual DDS::DomainParticipant* DDS::DomainParticipantFactoryInterface::create_participant(DDS::DomainId_t, const DDS::DomainParticipantQos&, DDS::DomainParticipantListener*, DDS::StatusMask)’ make[2]: *** [src/dds/CMakeFiles/libSimD.dir/domain.cpp.o] Error 1 make[1]: *** [src/dds/CMakeFiles/libSimD.dir/all] Error 2 make: *** [all] Error 2 What shall I do?
×